{"text_format":"1","workbook":"xlsx","n_sheets":5,"sheets":["Anasayfa","Sözleşmeli","Katsayı","Gelir V.","Kodlar"],"not_rendered":{"charts":0,"images":0,"macros":1,"external_links":0,"defined_names":2,"comments":0,"pivot_tables":0},"unopened":[],"bounds":{"document_bytes":16777216,"sheet_cells":100000,"rows_first":2000,"rows_last":500,"rows_between":2000,"halvings":0,"cell_chars":16384,"cell_head_chars":4096},"cells_cut":0,"cells_raw":0,"read":"whole","date_system":"1900"}

{"sheet":"Anasayfa","index":0,"n_rows":32,"n_cols":8,"rows_kept":32,"cut":false,"hidden":false,"merged":[[0,1,0,7]]}
[null,"Kadrolu Öğretmenlerin Ek Ders Ücreti Hesaplama Programı-V.1.0"]
[null,"Maaş Katsayısı",{"$f":"VLOOKUP(H2,Katsayı!A2:B400,2)","v":0.16578599999999999},null,null,"Ait Olduğu Ay/Yıl",null,"2021-01-01"]
[null,"Gelir Vergisi %",0.15]
[null,"Damga Vergisi(Binde)",7.59]
[]
[null,"EK DERS ÜCRETİ TİPİ","EK DERS SAATİ","BRÜT EKDERS","GELİR VERGİSİ","DAMGA VERGİSİ","KESİNTİ TOPLAMI","NET EKDERS"]
[null,"Gündüz",76,{"$f":"ROUND((VLOOKUP($B$7:$B$31,Kodlar!$A$2:$B$25,2,)*C7*$C$2),2)","v":1763.96},{"$f":"ROUND((D7*$C$3),2)","v":264.58999999999997},{"$f":"ROUND(((D7*$C$4)/1000),2)","v":13.39},{"$f":"SUM(E7:F7)","v":277.97999999999996},{"$f":"D7-G7","v":1485.98}]
[null,"Gece",null,{"$f":"ROUND((VLOOKUP($B$7:$B$31,Kodlar!$A$2:$B$25,2,)*C8*$C$2),2)","v":0},{"$f":"ROUND((D8*$C$3),2)","v":0},{"$f":"ROUND(((D8*$C$4)/1000),2)","v":0},{"$f":"SUM(E8:F8)","v":0},{"$f":"D8-G8","v":0}]
[null,"Gündüz (Yüksek Lisans)",null,{"$f":"ROUND((VLOOKUP($B$7:$B$31,Kodlar!$A$2:$B$25,2,)*C9*$C$2),2)","v":0},{"$f":"ROUND((D9*$C$3),2)","v":0},{"$f":"ROUND(((D9*$C$4)/1000),2)","v":0},{"$f":"SUM(E9:F9)","v":0},{"$f":"D9-G9","v":0}]
[null,"%25 Fazla Gündüz",null,{"$f":"ROUND((VLOOKUP($B$7:$B$31,Kodlar!$A$2:$B$25,2,)*C10*$C$2),2)","v":0},0,0,0,0]
[null,"%25 Fazla Gece",null,{"$f":"ROUND((VLOOKUP($B$7:$B$31,Kodlar!$A$2:$B$25,2,)*C11*$C$2),2)","v":0},0,0,0,0]
[null,"Belleticilik",null,{"$f":"ROUND((VLOOKUP($B$7:$B$31,Kodlar!$A$2:$B$25,2,)*C12*$C$2),2)","v":0},0,0,0,0]
[null,"Sınav Görevi",null,{"$f":"ROUND((VLOOKUP($B$7:$B$31,Kodlar!$A$2:$B$25,2,)*C13*$C$2),2)","v":0},0,0,0,0]
[null,"Egzersiz",null,{"$f":"ROUND((VLOOKUP($B$7:$B$31,Kodlar!$A$2:$B$25,2,)*C14*$C$2),2)","v":0},0,0,0,0]
[null,"Hizmetiçi",null,{"$f":"ROUND((VLOOKUP($B$7:$B$31,Kodlar!$A$2:$B$25,2,)*C15*$C$2),2)","v":0},0,0,0,0]
[null,"Ekders Yer.Geç.Gör. - Gündüz",null,{"$f":"ROUND((VLOOKUP($B$7:$B$31,Kodlar!$A$2:$B$25,2,)*C16*$C$2),2)","v":0},0,0,0,0]
[null,"Ekders Yer.Geç.Gör. - Gece",null,{"$f":"ROUND((VLOOKUP($B$7:$B$31,Kodlar!$A$2:$B$25,2,)*C17*$C$2),2)","v":0},0,0,0,0]
[null,"Ekders Yer.Geç.Gör. - %25 Gündüz",null,{"$f":"ROUND((VLOOKUP($B$7:$B$31,Kodlar!$A$2:$B$25,2,)*C18*$C$2),2)","v":0},0,0,0,0]
[null,"Ekders Yer.Geç.Gör. - %25 Gece",null,{"$f":"ROUND((VLOOKUP($B$7:$B$31,Kodlar!$A$2:$B$25,2,)*C19*$C$2),2)","v":0},0,0,0,0]
[null,"Atış Eğitimi",null,{"$f":"ROUND((VLOOKUP($B$7:$B$31,Kodlar!$A$2:$B$25,2,)*C20*$C$2),2)","v":0},0,0,0,0]
[null,"Cezaevleri Eğitim Merkezi - 160*Saat",null,{"$f":"ROUND((VLOOKUP($B$7:$B$31,Kodlar!$A$2:$B$25,2,)*C21*$C$2),2)","v":0},0,0,0,0]
[null,"Takviye kursu(Gündüz)",null,{"$f":"ROUND((VLOOKUP($B$7:$B$31,Kodlar!$A$2:$B$25,2,)*C22*$C$2),2)","v":0},0,0,0,0]
[null,"Takviye kursu(Haftasonu/Gece)",null,{"$f":"ROUND((VLOOKUP($B$7:$B$31,Kodlar!$A$2:$B$25,2,)*C23*$C$2),2)","v":0},0,0,0,0]
[null,"Belleticilik %25 Fazla",null,{"$f":"ROUND((VLOOKUP($B$7:$B$31,Kodlar!$A$2:$B$25,2,)*C24*$C$2),2)","v":0},0,0,0,0]
[null,"Nöbet Görevi",null,{"$f":"ROUND((VLOOKUP($B$7:$B$31,Kodlar!$A$2:$B$25,2,)*C25*$C$2),2)","v":0},0,0,0,0]
[null,"Salon Başkanı",null,{"$f":"ROUND((VLOOKUP($B$7:$B$31,Kodlar!$A$2:$B$25,2,)*C26*$C$2),2)","v":0},0,0,0,0]
[null,"Gözetmen",null,{"$f":"ROUND((VLOOKUP($B$7:$B$31,Kodlar!$A$2:$B$25,2,)*C27*$C$2),2)","v":0},0,0,0,0]
[null,"Yedek Gözetmen",null,{"$f":"ROUND((VLOOKUP($B$7:$B$31,Kodlar!$A$2:$B$25,2,)*C28*$C$2),2)","v":0},0,0,0,0]
[null,"Yardımcı Engelli Gözetmen",null,{"$f":"ROUND((VLOOKUP($B$7:$B$31,Kodlar!$A$2:$B$25,2,)*C29*$C$2),2)","v":0},0,0,0,0]
[null,"Bina Sınav Komisyonu Başkanı",null,{"$f":"ROUND((VLOOKUP($B$7:$B$31,Kodlar!$A$2:$B$25,2,)*C30*$C$2),2)","v":0},0,0,0,0]
[null,"Bina Sınav Komisyonu Üyesi",null,{"$f":"ROUND((VLOOKUP($B$7:$B$31,Kodlar!$A$2:$B$30,2,)*C31*$C$2),2)","v":0},0,0,0,0]
[null,"GENEL TOPLAM",null,{"$f":"SUM(D7:D31)","v":1763.96},{"$f":"SUM(E7:E31)","v":264.58999999999997},13.39,277.97999999999996,1485.98]

{"sheet":"Sözleşmeli","index":1,"n_rows":32,"n_cols":10,"rows_kept":32,"cut":false,"hidden":false,"merged":[[0,1,0,9]]}
[null,"Sözleşmeli Öğretmenlerin Ek Ders Ücreti Hesaplama Programı-V.1.0"]
[null,"Maaş Katsayısı",{"$f":"VLOOKUP(J2,Katsayı!A2:B400,2)","v":0.16578599999999999},null,null,null,null,"Ait Olduğu Ay/Yıl",null,"2021-01-01"]
[null,"Gelir Vergisi %",0.15]
[null,"Damga Vergisi(Binde)",7.59]
[]
[null,"EK DERS ÜCRETİ TİPİ","EK DERS SAATİ","BRÜT EKDERS","SGK DEV.KAT. %20,5","SGK KİŞİ KES. %14","GELİR VERGİSİ","DAMGA VERGİSİ","KESİNTİ TOPLAMI","NET EKDERS"]
[null,"Gündüz",100,{"$f":"ROUND((VLOOKUP($B$7:$B$31,Kodlar!$A$2:$B$25,2,)*C7*$C$2),2)","v":2321},{"$f":"ROUND((D7*0.205),2)","v":475.81},{"$f":"ROUND((D7*0.14),2)","v":324.94},{"$f":"ROUND(((D7-F7)*$C$3),2)","v":299.41000000000003},{"$f":"ROUND(((D7*$C$4)/1000),2)","v":17.62},{"$f":"SUM(E7:H7)","v":1117.78},{"$f":"D7+E7-I7","v":1679.03}]
[null,"Gece",null,{"$f":"ROUND((VLOOKUP($B$7:$B$31,Kodlar!$A$2:$B$25,2,)*C8*$C$2),2)","v":0},{"$f":"ROUND((D8*0.205),2)","v":0},{"$f":"ROUND((D8*0.14),2)","v":0},{"$f":"ROUND(((D8-F8)*$C$3),2)","v":0},{"$f":"ROUND(((D8*$C$4)/1000),2)","v":0},{"$f":"SUM(E8:H8)","v":0},{"$f":"D8+E8-I8","v":0}]
[null,"Gündüz (Yüksek Lisans)",null,{"$f":"ROUND((VLOOKUP($B$7:$B$31,Kodlar!$A$2:$B$25,2,)*C9*$C$2),2)","v":0},0,0,0,0,0,0]
[null,"%25 Fazla Gündüz",null,{"$f":"ROUND((VLOOKUP($B$7:$B$31,Kodlar!$A$2:$B$25,2,)*C10*$C$2),2)","v":0},0,0,0,0,0,0]
[null,"%25 Fazla Gece",null,{"$f":"ROUND((VLOOKUP($B$7:$B$31,Kodlar!$A$2:$B$25,2,)*C11*$C$2),2)","v":0},0,0,0,0,0,0]
[null,"Belleticilik",null,{"$f":"ROUND((VLOOKUP($B$7:$B$31,Kodlar!$A$2:$B$25,2,)*C12*$C$2),2)","v":0},0,0,0,0,0,0]
[null,"Sınav Görevi",null,{"$f":"ROUND((VLOOKUP($B$7:$B$31,Kodlar!$A$2:$B$25,2,)*C13*$C$2),2)","v":0},0,0,0,0,0,0]
[null,"Egzersiz",null,{"$f":"ROUND((VLOOKUP($B$7:$B$31,Kodlar!$A$2:$B$25,2,)*C14*$C$2),2)","v":0},0,0,0,0,0,0]
[null,"Hizmetiçi",null,{"$f":"ROUND((VLOOKUP($B$7:$B$31,Kodlar!$A$2:$B$25,2,)*C15*$C$2),2)","v":0},0,0,0,0,0,0]
[null,"Ekders Yer.Geç.Gör. - Gündüz",null,{"$f":"ROUND((VLOOKUP($B$7:$B$31,Kodlar!$A$2:$B$25,2,)*C16*$C$2),2)","v":0},0,0,0,0,0,0]
[null,"Ekders Yer.Geç.Gör. - Gece",null,{"$f":"ROUND((VLOOKUP($B$7:$B$31,Kodlar!$A$2:$B$25,2,)*C17*$C$2),2)","v":0},0,0,0,0,0,0]
[null,"Ekders Yer.Geç.Gör. - %25 Gündüz",null,{"$f":"ROUND((VLOOKUP($B$7:$B$31,Kodlar!$A$2:$B$25,2,)*C18*$C$2),2)","v":0},0,0,0,0,0,0]
[null,"Ekders Yer.Geç.Gör. - %25 Gece",null,{"$f":"ROUND((VLOOKUP($B$7:$B$31,Kodlar!$A$2:$B$25,2,)*C19*$C$2),2)","v":0},0,0,0,0,0,0]
[null,"Atış Eğitimi",null,{"$f":"ROUND((VLOOKUP($B$7:$B$31,Kodlar!$A$2:$B$25,2,)*C20*$C$2),2)","v":0},0,0,0,0,0,0]
[null,"Cezaevleri Eğitim Merkezi - 160*Saat",null,{"$f":"ROUND((VLOOKUP($B$7:$B$31,Kodlar!$A$2:$B$25,2,)*C21*$C$2),2)","v":0},0,0,0,0,0,0]
[null,"Takviye kursu(Gündüz)",null,{"$f":"ROUND((VLOOKUP($B$7:$B$31,Kodlar!$A$2:$B$25,2,)*C22*$C$2),2)","v":0},0,0,0,0,0,0]
[null,"Takviye kursu(Haftasonu/Gece)",null,{"$f":"ROUND((VLOOKUP($B$7:$B$31,Kodlar!$A$2:$B$25,2,)*C23*$C$2),2)","v":0},0,0,0,0,0,0]
[null,"Belleticilik %25 Fazla",null,{"$f":"ROUND((VLOOKUP($B$7:$B$31,Kodlar!$A$2:$B$25,2,)*C24*$C$2),2)","v":0},0,0,0,0,0,0]
[null,"Nöbet Görevi",null,{"$f":"ROUND((VLOOKUP($B$7:$B$31,Kodlar!$A$2:$B$25,2,)*C25*$C$2),2)","v":0},0,0,0,0,0,0]
[null,"Salon Başkanı",null,{"$f":"ROUND((VLOOKUP($B$7:$B$31,Kodlar!$A$2:$B$25,2,)*C26*$C$2),2)","v":0},0,0,0,0,0,0]
[null,"Gözetmen",null,{"$f":"ROUND((VLOOKUP($B$7:$B$31,Kodlar!$A$2:$B$25,2,)*C27*$C$2),2)","v":0},0,0,0,0,0,0]
[null,"Yedek Gözetmen",null,{"$f":"ROUND((VLOOKUP($B$7:$B$31,Kodlar!$A$2:$B$25,2,)*C28*$C$2),2)","v":0},0,0,0,0,0,0]
[null,"Yardımcı Engelli Gözetmen",null,{"$f":"ROUND((VLOOKUP($B$7:$B$31,Kodlar!$A$2:$B$25,2,)*C29*$C$2),2)","v":0},0,0,0,0,0,0]
[null,"Bina Sınav Komisyonu Başkanı",null,{"$f":"ROUND((VLOOKUP($B$7:$B$31,Kodlar!$A$2:$B$25,2,)*C30*$C$2),2)","v":0},0,0,0,0,0,0]
[null,"Bina Sınav Komisyonu Üyesi",null,{"$f":"ROUND((VLOOKUP($B$7:$B$31,Kodlar!$A$2:$B$30,2,)*C31*$C$2),2)","v":0},0,0,0,0,0,0]
[null,"GENEL TOPLAM",null,{"$f":"SUM(D7:D31)","v":2321},null,null,{"$f":"SUM(G7:G31)","v":299.41000000000003},17.62,1117.78,1679.03]

{"sheet":"Katsayı","index":2,"n_rows":400,"n_cols":2,"rows_kept":400,"cut":false,"hidden":false,"merged":[]}
["Ay/Yıl","KATSAYILAR"]
["2001-01-01",1.8239999999999999E-2]
["2001-02-01",1.8239999999999999E-2]
["2001-03-01",1.8239999999999999E-2]
["2001-04-01",1.8700000000000001E-2]
["2001-05-01",2.06E-2]
["2001-06-01",2.1649999999999999E-2]
["2001-07-01",2.1649999999999999E-2]
["2001-08-01",2.1649999999999999E-2]
["2001-09-01",2.3550000000000001E-2]
["2001-10-01",2.4920000000000001E-2]
["2001-11-01",2.6419999999999999E-2]
["2001-12-01",2.7529999999999999E-2]
["2002-01-01",3.0300000000000001E-2]
["2002-02-01",3.0300000000000001E-2]
["2002-03-01",3.0300000000000001E-2]
["2002-04-01",3.0300000000000001E-2]
["2002-05-01",3.1060000000000001E-2]
["2002-06-01",3.1060000000000001E-2]
["2002-07-01",3.2605000000000002E-2]
["2002-08-01",3.2605000000000002E-2]
["2002-09-01",3.2605000000000002E-2]
["2002-10-01",3.2605000000000002E-2]
["2002-11-01",3.2605000000000002E-2]
["2002-12-01",3.2605000000000002E-2]
["2003-01-01",3.4299999999999997E-2]
["2003-02-01",3.4299999999999997E-2]
["2003-03-01",3.4299999999999997E-2]
["2003-04-01",3.4299999999999997E-2]
["2003-05-01",3.4299999999999997E-2]
["2003-06-01",3.4299999999999997E-2]
["2003-07-01",3.4299999999999997E-2]
["2003-08-01",3.4299999999999997E-2]
["2003-09-01",3.4299999999999997E-2]
["2003-10-01",3.4299999999999997E-2]
["2003-11-01",3.4299999999999997E-2]
["2003-12-01",3.4299999999999997E-2]
["2004-01-01",3.6420000000000001E-2]
["2004-02-01",3.6420000000000001E-2]
["2004-03-01",3.6420000000000001E-2]
["2004-04-01",3.6420000000000001E-2]
["2004-05-01",3.6420000000000001E-2]
["2004-06-01",3.6420000000000001E-2]
["2004-07-01",3.8609999999999998E-2]
["2004-08-01",3.8609999999999998E-2]
["2004-09-01",3.8609999999999998E-2]
["2004-10-01",3.8609999999999998E-2]
["2004-11-01",3.8609999999999998E-2]
["2004-12-01",3.8609999999999998E-2]
["2005-01-01",4.0099999999999997E-2]
["2005-02-01",4.0099999999999997E-2]
["2005-03-01",4.0099999999999997E-2]
["2005-04-01",4.0099999999999997E-2]
["2005-05-01",4.0099999999999997E-2]
["2005-06-01",4.0099999999999997E-2]
["2005-07-01",4.1599999999999998E-2]
["2005-08-01",4.1599999999999998E-2]
["2005-09-01",4.1599999999999998E-2]
["2005-10-01",4.1599999999999998E-2]
["2005-11-01",4.1599999999999998E-2]
["2005-12-01",4.1599999999999998E-2]
["2006-01-01",4.265E-2]
["2006-02-01",4.265E-2]
["2006-03-01",4.265E-2]
["2006-04-01",4.265E-2]
["2006-05-01",4.265E-2]
["2006-06-01",4.265E-2]
["2006-07-01",4.3729999999999998E-2]
["2006-08-01",4.3729999999999998E-2]
["2006-09-01",4.4745E-2]
["2006-10-01",4.4745E-2]
["2006-11-01",4.4745E-2]
["2006-12-01",4.4745E-2]
["2007-01-01",4.6984999999999999E-2]
["2007-02-01",4.6984999999999999E-2]
["2007-03-01",4.6984999999999999E-2]
["2007-04-01",4.6984999999999999E-2]
["2007-05-01",4.6984999999999999E-2]
["2007-06-01",4.6984999999999999E-2]
["2007-07-01",4.8349999999999997E-2]
["2007-08-01",4.8349999999999997E-2]
["2007-09-01",4.8349999999999997E-2]
["2007-10-01",4.8349999999999997E-2]
["2007-11-01",4.8349999999999997E-2]
["2007-12-01",4.8349999999999997E-2]
["2008-01-01",4.9486000000000002E-2]
["2008-02-01",4.9486000000000002E-2]
["2008-03-01",4.9486000000000002E-2]
["2008-04-01",4.9486000000000002E-2]
["2008-05-01",4.9486000000000002E-2]
["2008-06-01",4.9486000000000002E-2]
["2008-07-01",5.1448000000000001E-2]
["2008-08-01",5.1448000000000001E-2]
["2008-09-01",5.1448000000000001E-2]
["2008-10-01",5.1448000000000001E-2]
["2008-11-01",5.1448000000000001E-2]
["2008-12-01",5.1448000000000001E-2]
["2009-01-01",5.3504999999999997E-2]
["2009-02-01",5.3504999999999997E-2]
["2009-03-01",5.3504999999999997E-2]
["2009-04-01",5.3504999999999997E-2]
["2009-05-01",5.3504999999999997E-2]
["2009-06-01",5.3504999999999997E-2]
["2009-07-01",5.5919999999999997E-2]
["2009-08-01",5.5919999999999997E-2]
["2009-09-01",5.5919999999999997E-2]
["2009-10-01",5.5919999999999997E-2]
["2009-11-01",5.5919999999999997E-2]
["2009-12-01",5.5919999999999997E-2]
["2010-01-01",5.7383000000000003E-2]
["2010-02-01",5.7383000000000003E-2]
["2010-03-01",5.7383000000000003E-2]
["2010-04-01",5.7383000000000003E-2]
["2010-05-01",5.7383000000000003E-2]
["2010-06-01",5.7383000000000003E-2]
["2010-07-01",5.9444999999999998E-2]
["2010-08-01",5.9444999999999998E-2]
["2010-09-01",5.9444999999999998E-2]
["2010-10-01",5.9444999999999998E-2]
["2010-11-01",5.9444999999999998E-2]
["2010-12-01",5.9444999999999998E-2]
["2011-01-01",6.1954000000000002E-2]
["2011-02-01",6.1954000000000002E-2]
["2011-03-01",6.1954000000000002E-2]
["2011-04-01",6.1954000000000002E-2]
["2011-05-01",6.1954000000000002E-2]
["2011-06-01",6.1954000000000002E-2]
["2011-07-01",6.4460000000000003E-2]
["2011-08-01",6.4460000000000003E-2]
["2011-09-01",6.4460000000000003E-2]
["2011-10-01",6.4460000000000003E-2]
["2011-11-01",6.4460000000000003E-2]
["2011-12-01",6.4460000000000003E-2]
["2012-01-01",6.8834999999999993E-2]
["2012-02-01",6.8834999999999993E-2]
["2012-03-01",6.8834999999999993E-2]
["2012-04-01",6.8834999999999993E-2]
["2012-05-01",6.8834999999999993E-2]
["2012-06-01",6.8834999999999993E-2]
["2012-07-01",7.1589E-2]
["2012-08-01",7.1589E-2]
["2012-09-01",7.1589E-2]
["2012-10-01",7.1589E-2]
["2012-11-01",7.1589E-2]
["2012-12-01",7.1589E-2]
["2013-01-01",7.3837E-2]
["2013-02-01",7.3837E-2]
["2013-03-01",7.3837E-2]
["2013-04-01",7.3837E-2]
["2013-05-01",7.3837E-2]
["2013-06-01",7.3837E-2]
["2013-07-01",7.6790999999999998E-2]
["2013-08-01",7.6790999999999998E-2]
["2013-09-01",7.6790999999999998E-2]
["2013-10-01",7.6790999999999998E-2]
["2013-11-01",7.6790999999999998E-2]
["2013-12-01",7.6790999999999998E-2]
["2014-01-01",7.6997999999999997E-2]
["2014-02-01",7.6997999999999997E-2]
["2014-03-01",7.6997999999999997E-2]
["2014-04-01",7.6997999999999997E-2]
["2014-05-01",7.6997999999999997E-2]
["2014-06-01",7.6997999999999997E-2]
["2014-07-01",7.6997999999999997E-2]
["2014-08-01",7.6997999999999997E-2]
["2014-09-01",7.6997999999999997E-2]
["2014-10-01",7.6997999999999997E-2]
["2014-11-01",7.6997999999999997E-2]
["2014-12-01",7.6997999999999997E-2]
["2015-01-01",7.9308000000000003E-2]
["2015-02-01",7.9308000000000003E-2]
["2015-03-01",7.9308000000000003E-2]
["2015-04-01",7.9308000000000003E-2]
["2015-05-01",7.9308000000000003E-2]
["2015-06-01",7.9308000000000003E-2]
["2015-07-01",8.3084000000000005E-2]
["2015-08-01",8.3084000000000005E-2]
["2015-09-01",8.3084000000000005E-2]
["2015-10-01",8.3084000000000005E-2]
["2015-11-01",8.3084000000000005E-2]
["2015-12-01",8.3084000000000005E-2]
["2016-01-01",8.8816999999999993E-2]
["2016-02-01",8.8816999999999993E-2]
["2016-03-01",8.8816999999999993E-2]
["2016-04-01",8.8816999999999993E-2]
["2016-05-01",8.8816999999999993E-2]
["2016-06-01",8.8816999999999993E-2]
["2016-07-01",9.3258999999999995E-2]
["2016-08-01",9.3258999999999995E-2]
["2016-09-01",9.3258999999999995E-2]
["2016-10-01",9.3258999999999995E-2]
["2016-11-01",9.3258999999999995E-2]
["2016-12-01",9.3258999999999995E-2]
["2017-01-01",9.6058000000000004E-2]
["2017-02-01",9.6058000000000004E-2]
["2017-03-01",9.6058000000000004E-2]
["2017-04-01",9.6058000000000004E-2]
["2017-05-01",9.6058000000000004E-2]
["2017-06-01",9.6058000000000004E-2]
["2017-07-01",0.10270600000000001]
["2017-08-01",0.10270600000000001]
["2017-09-01",0.10270600000000001]
["2017-10-01",0.10270600000000001]
["2017-11-01",0.10270600000000001]
["2017-12-01",0.10270600000000001]
["2018-01-01",0.10854999999999999]
["2018-02-01",0.10854999999999999]
["2018-03-01",0.10854999999999999]
["2018-04-01",0.10854999999999999]
["2018-05-01",0.10854999999999999]
["2018-06-01",0.10854999999999999]
["2018-07-01",0.11794]
["2018-08-01",0.11794]
["2018-09-01",0.11794]
["2018-10-01",0.11794]
["2018-11-01",0.11794]
["2018-12-01",0.11794]
["2019-01-01",0.13059699999999999]
["2019-02-01",0.13059699999999999]
["2019-03-01",0.13059699999999999]
["2019-04-01",0.13059699999999999]
["2019-05-01",0.13059699999999999]
["2019-06-01",0.13059699999999999]
["2019-07-01",0.138459]
["2019-08-01",0.138459]
["2019-09-01",0.138459]
["2019-10-01",0.138459]
["2019-11-01",0.138459]
["2019-12-01",0.138459]
["2020-01-01",0.146061]
["2020-02-01",0.146061]
["2020-03-01",0.146061]
["2020-04-01",0.146061]
["2020-05-01",0.146061]
["2020-06-01",0.146061]
["2020-07-01",0.15446099999999999]
["2020-08-01",0.15446099999999999]
["2020-09-01",0.15446099999999999]
["2020-10-01",0.15446099999999999]
["2020-11-01",0.15446099999999999]
["2020-12-01",0.15446099999999999]
["2021-01-01",0.16578599999999999]
["2021-02-01",0.16578599999999999]
["2021-03-01",0.16578599999999999]
["2021-04-01",0.16578599999999999]
["2021-05-01",0.16578599999999999]
["2021-06-01",0.16578599999999999]
["2021-07-01"]
["2021-08-01"]
["2021-09-01"]
["2021-10-01"]
["2021-11-01"]
["2021-12-01"]
["2022-01-01"]
["2022-02-01"]
["2022-03-01"]
["2022-04-01"]
["2022-05-01"]
["2022-06-01"]
["2022-07-01"]
["2022-08-01"]
["2022-09-01"]
["2022-10-01"]
["2022-11-01"]
["2022-12-01"]
["2023-01-01"]
["2023-02-01"]
["2023-03-01"]
["2023-04-01"]
["2023-05-01"]
["2023-06-01"]
["2023-07-01"]
["2023-08-01"]
["2023-09-01"]
["2023-10-01"]
["2023-11-01"]
["2023-12-01"]
["2024-01-01"]
["2024-02-01"]
["2024-03-01"]
["2024-04-01"]
["2024-05-01"]
["2024-06-01"]
["2024-07-01"]
["2024-08-01"]
["2024-09-01"]
["2024-10-01"]
["2024-11-01"]
["2024-12-01"]
["2025-01-01"]
["2025-02-01"]
["2025-03-01"]
["2025-04-01"]
["2025-05-01"]
["2025-06-01"]
["2025-07-01"]
["2025-08-01"]
["2025-09-01"]
["2025-10-01"]
["2025-11-01"]
["2025-12-01"]
["2026-01-01"]
["2026-02-01"]
["2026-03-01"]
["2026-04-01"]
["2026-05-01"]
["2026-06-01"]
["2026-07-01"]
["2026-08-01"]
["2026-09-01"]
["2026-10-01"]
["2026-11-01"]
["2026-12-01"]
["2027-01-01"]
["2027-02-01"]
["2027-03-01"]
["2027-04-01"]
["2027-05-01"]
["2027-06-01"]
["2027-07-01"]
["2027-08-01"]
["2027-09-01"]
["2027-10-01"]
["2027-11-01"]
["2027-12-01"]
["2028-01-01"]
["2028-02-01"]
["2028-03-01"]
["2028-04-01"]
["2028-05-01"]
["2028-06-01"]
["2028-07-01"]
["2028-08-01"]
["2028-09-01"]
["2028-10-01"]
["2028-11-01"]
["2028-12-01"]
["2029-01-01"]
["2029-02-01"]
["2029-03-01"]
["2029-04-01"]
["2029-05-01"]
["2029-06-01"]
["2029-07-01"]
["2029-08-01"]
["2029-09-01"]
["2029-10-01"]
["2029-11-01"]
["2029-12-01"]
["2030-01-01"]
["2030-02-01"]
["2030-03-01"]
["2030-04-01"]
["2030-05-01"]
["2030-06-01"]
["2030-07-01"]
["2030-08-01"]
["2030-09-01"]
["2030-10-01"]
["2030-11-01"]
["2030-12-01"]
["2031-01-01"]
["2031-02-01"]
["2031-03-01"]
["2031-04-01"]
["2031-05-01"]
["2031-06-01"]
["2031-07-01"]
["2031-08-01"]
["2031-09-01"]
["2031-10-01"]
["2031-11-01"]
["2031-12-01"]
["2032-01-01"]
["2032-02-01"]
["2032-03-01"]
["2032-04-01"]
["2032-05-01"]
["2032-06-01"]
["2032-07-01"]
["2032-08-01"]
["2032-09-01"]
["2032-10-01"]
["2032-11-01"]
["2032-12-01"]
["2033-01-01"]
["2033-02-01"]
["2033-03-01"]
["2033-04-01"]
["2033-05-01"]
["2033-06-01"]
["2033-07-01"]
["2033-08-01"]
["2033-09-01"]
["2033-10-01"]
["2033-11-01"]
["2033-12-01"]
["2034-01-01"]
["2034-02-01"]
["2034-03-01"]
{"$rows_left_out":1}
{"sheet":"Gelir V.","index":3,"n_rows":6,"n_cols":2,"rows_kept":6,"cut":false,"hidden":false,"merged":[[0,0,0,1]]}
["GELİR VERGİSİ"]
[0.15,"1. DİLİM"]
[0.2,"2. DİLİM"]
[0.27,"3. DİLİM"]
[0.35,"4. DİLİM"]
[0]

{"sheet":"Kodlar","index":4,"n_rows":26,"n_cols":4,"rows_kept":26,"cut":false,"hidden":false,"merged":[]}
["Veri Tipi","GÖSTERGE","S.N.","Veri Tip Kodu"]
["Gündüz",140,1,101]
["Gece",150,2,102]
["Gündüz (Yüksek Lisans)",147,3]
["%25 Fazla Gündüz",175,4,103]
["%25 Fazla Gece",187.5,5,104]
["Belleticilik",140,6,106]
["Sınav Görevi",140,7,107]
["Egzersiz",140,8,108]
["Hizmetiçi",140,9,109]
["Ekders Yer.Geç.Gör. - Gündüz",140,10,110]
["Ekders Yer.Geç.Gör. - Gece",150,11,111]
["Ekders Yer.Geç.Gör. - %25 Gündüz",175,12,112]
["Ekders Yer.Geç.Gör. - %25 Gece",187.5,13,113]
["Atış Eğitimi",140,14,114]
["Cezaevleri Eğitim Merkezi - 160*Saat",160,15,115]
["Takviye kursu(Gündüz)",280,16,116]
["Takviye kursu(Haftasonu/Gece)",300,17,117]
["Belleticilik %25 Fazla",175,18,118]
["Nöbet Görevi",140,19,119]
["Salon Başkanı",1650,20,120]
["Gözetmen",1600,21,121]
["Yedek Gözetmen",1200,22,122]
["Yardımcı Engelli Gözetmen",2000,23,123]
["Bina Sınav Komisyonu Başkanı",1900,24,124]
["Bina Sınav Komisyonu Üyesi",1700,25,125]